access
type: DatatypeProperty
comment: added from BSP (per-class property assessment)
domain includes: Contact Point
range includes: string
definition: Access information, expressed as text, for the mode of universal communication such as 9 or *70 for a telephone network.
term status: proposed

complete number
type: DatatypeProperty
comment: added from BSP (per-class property assessment)
domain includes: Contact Point
range includes: string
definition: The text string of characters that make up the complete number for this universal communication.
term status: proposed

h tmlpreferred indicator
type: DatatypeProperty
comment: added from BSP (per-class property assessment)
domain includes: Contact Point
range includes: string
definition: The indication of whether or not HTML format is preferred by the recipient for email universal communications.
term status: proposed

communication channel code
type: ObjectProperty
comment: added from BSP (default-keep re-triage)
domain includes: Contact Point
range includes: communication-channel-code-list
definition: The code specifying the channel by which this referenced document is sent, such as mail, email, fax.
term status: proposed

website
type: DatatypeProperty
domain includes: Contact Point
domain includes: Party
range includes: anyURI
definition: A web URL of a party or contact point.
term status: proposed

u riid
type: DatatypeProperty
comment: added from BSP (per-class property assessment)
domain includes: Contact Point
range includes: anyURI
definition: A Uniform Resource Identifier (URI) for this specified certification.
term status: proposed

country number code
type: ObjectProperty
comment: added from BSP (per-class property assessment)
domain includes: Contact Point
range includes: itu-calling-code
definition: The country access code for this universal communication number such as 44, 1, 353 etc.
term status: proposed

local number
type: DatatypeProperty
comment: added from BSP (per-class property assessment)
domain includes: Contact Point
range includes: string
definition: The universal communication number, expressed as text and not including country access code or the area number code, for this communication.
term status: proposed

area number code
type: ObjectProperty
comment: added from BSP (per-class property assessment)
domain includes: Contact Point
range includes: any-code
definition: The code specifying the area number for this universal communication.
term status: proposed

Contact Point
type: Class
comment: reshaped from BSP Communication.
definition: An addressable channel for communicating with a party (telephone, email, web, messaging), with its number or URI and use type.
object nature: value
term status: proposed

extension number
type: DatatypeProperty
comment: added from BSP (per-class property assessment)
domain includes: Contact Point
range includes: string
definition: The extension number, expressed as text, assigned to this universal communication number to enable a caller to reach a specific party.
term status: proposed

email
type: DatatypeProperty
domain includes: Party
domain includes: Contact Point
range includes: string
definition: An email address of a party or contact point.
term status: proposed

use code
type: ObjectProperty
comment: added from BSP (per-class property assessment)
domain includes: Contact Point
range includes: any-code
definition: The code specifying the use of this universal communication such as for business purposes or private.
term status: proposed