category code
type: ObjectProperty
comment: added from BSP (per-class property assessment)
definition: A code specifying a category for this cross-border regulatory procedure, such as the appendices of the CITES Convention.
domain includes: Government Registration
range includes: any-code
term status: proposed

country sub division id
type: ObjectProperty
comment: added from BSP (per-class property assessment)
definition: A unique identifier of the country sub-division for this legal registration.
domain includes: Government Registration
range includes: iso-3166-2
term status: proposed

description
type: DatatypeProperty
definition: A textual description of an item.
range includes: string
term status: proposed

identifier
type: ObjectProperty
definition: An identifier of this entity within some scheme, as an Identifier value object; an entity may bear several (e.g. a GTIN and an internal SKU). Its own resolvable identity is the node URI (@id).
range includes: Identifier
term status: proposed

last registered year date time
type: DatatypeProperty
comment: added from BSP (per-class property assessment)
definition: The last registered year of this government registration.
domain includes: Government Registration
range includes: dateTime
term status: proposed

licence id
type: ObjectProperty
comment: added from BSP (per-class property assessment)
definition: The identifier of a licence for this government registration.
domain includes: Government Registration
range includes: Identifier
term status: proposed

name
type: DatatypeProperty
definition: The name of an item.
domain includes: Identifier
range includes: string
term status: proposed

recorded date
type: DatatypeProperty
comment: added from BSP (per-class property assessment)
definition: A date when this legal registration was recorded.
domain includes: Government Registration
range includes: date
term status: proposed

Government Registration
type: Class
comment: added from BSP (default-keep re-triage)
definition: The recording of items or details for a governmental purpose.
object nature: entity
term status: proposed