associated standard
type: ObjectProperty
comment: added from BSP (per-class property assessment)
definition: A referenced standard associated to this specified licence.
domain includes: Licence
range includes: Standard
term status: proposed

assurance level code
type: ObjectProperty
comment: added from BSP (per-class property assessment)
definition: A code specifying an assurance level of this specified declaration.
domain includes: Licence
range includes: any-code
term status: proposed

description
type: DatatypeProperty
definition: A textual description of an item.
range includes: string
term status: proposed

granted party
type: ObjectProperty
comment: added from BSP (per-class property assessment)
definition: A party granted this specified licence.
domain includes: Licence
range includes: Party
term status: proposed

identifier
type: ObjectProperty
definition: An identifier of this entity within some scheme, as an Identifier value object; an entity may bear several (e.g. a GTIN and an internal SKU). Its own resolvable identity is the node URI (@id).
range includes: Identifier
term status: proposed

issuer party
type: ObjectProperty
comment: added from BSP (per-class property assessment)
definition: A party that issues this specified declaration.
domain includes: Licence
range includes: Party
term status: proposed

name
type: DatatypeProperty
definition: The name of an item.
domain includes: Identifier
range includes: string
term status: proposed

valid indicator
type: DatatypeProperty
comment: added from BSP (per-class property assessment)
definition: The indication of whether or not this specified certificate is valid.
domain includes: Licence
range includes: string
term status: proposed

Licence
type: Class
comment: added from BSP (default-keep re-triage)
definition: A permit from an authority to own or use something, do a particular thing, or to conduct a trade.
object nature: entity
term status: proposed