currency
type: ObjectProperty
comment: code → ISO 4217 currency scheme.
definition: The currency of a monetary amount, as an ISO 4217 code.
domain includes: Monetary Amount
range includes: currency-code-list
term status: proposed

value
type: DatatypeProperty
definition: The numeric value of a measure or monetary amount.
domain includes: Measure
domain includes: Monetary Amount
range includes: decimal
term status: proposed

Monetary Amount
type: Class
definition: A monetary value together with its currency.
object nature: value
term status: proposed