bill start date time
type: DatatypeProperty
comment: added from BSP (per-class property assessment)
definition: The date, time, date time, or other date time value of the bill start specified by these trade payment terms.
domain includes: Payment Terms
range includes: dateTime
term status: proposed

discount percent
type: DatatypeProperty
definition: The early-payment discount percentage.
domain includes: Payment Terms
range includes: decimal
term status: proposed

due date
type: DatatypeProperty
definition: The date payment is due.
domain includes: Payment Terms
range includes: date
term status: proposed

due date time
type: DatatypeProperty
comment: added from BSP (per-class property assessment)
definition: The date, time, date time, or other date time value of the due date specified by these trade payment terms.
domain includes: Payment Terms
range includes: dateTime
term status: proposed

equivalent amount
type: ObjectProperty
comment: added from BSP (per-class property assessment)
definition: An equivalent monetary value to be transferred between debtor and creditor before deduction of charges for these trade payment terms, expressed in the currency of the debtor's account which is different from the currency in which it is to be transferred.
domain includes: Payment Terms
range includes: MonetaryAmount
term status: proposed

payment terms event time reference from event code
type: ObjectProperty
comment: added from BSP (per-class property assessment)
definition: The code specifying the event from which these trade payment terms are offered for a length of time.
domain includes: Payment Terms
range includes: any-code
term status: proposed

instructed amount
type: ObjectProperty
comment: added from BSP (per-class property assessment)
definition: A monetary value that has been instructed to be transferred between debtor and creditor for these trade payment terms before deduction of charges.
domain includes: Payment Terms
range includes: MonetaryAmount
term status: proposed

instruction code
type: ObjectProperty
comment: added from BSP (per-class property assessment)
definition: A code specifying an instruction for these trade payment terms.
domain includes: Payment Terms
range includes: any-code
term status: proposed

partial payment amount
type: ObjectProperty
comment: added from BSP (per-class property assessment)
definition: A monetary value of a partial payment in these trade payment terms.
domain includes: Payment Terms
range includes: MonetaryAmount
term status: proposed

partial payment percent
type: DatatypeProperty
comment: added from BSP (per-class property assessment)
definition: A partial payment, expressed as a percent, in these trade payment terms.
domain includes: Payment Terms
range includes: decimal
term status: proposed

payee party
type: ObjectProperty
comment: added from BSP (per-class property assessment)
definition: A payee party for this header trade settlement.
domain includes: Payment Terms
range includes: Party
term status: proposed

trade payment terms payment means id
type: ObjectProperty
comment: added from BSP (per-class property assessment)
definition: An identifier of a payment means in these trade payment terms.
domain includes: Payment Terms
range includes: PaymentMeans
term status: proposed

payment terms id
type: ObjectProperty
comment: added from BSP (per-class property assessment)
definition: The unique identifier of these trade payment terms.
domain includes: Payment Terms
range includes: payment-terms-id
term status: proposed

payment terms type code
type: ObjectProperty
comment: code → payment-terms-type scheme (re-added from BSP).
definition: The type of trade payment terms.
domain includes: Payment Terms
range includes: payment-terms-type-code-list
term status: proposed

penalty percent
type: DatatypeProperty
definition: The late-payment penalty percentage.
domain includes: Payment Terms
range includes: decimal
term status: proposed

settlement period measure
type: ObjectProperty
comment: added from BSP (per-class property assessment)
definition: The measure of the number of settlement periods from this trade payment term time reference to the latest payment date, such as 30 days, 3 months.
domain includes: Payment Terms
range includes: Measure
term status: proposed

trade payment terms direct debit mandate id
type: ObjectProperty
comment: added from BSP (per-class property assessment)
definition: An identifier of a direct debit mandate in these trade payment terms.
domain includes: Payment Terms
range includes: Identifier
term status: proposed

trade payment terms instruction type code
type: ObjectProperty
comment: added from BSP (per-class property assessment)
definition: A code specifying a type of instruction for these trade payment terms.
domain includes: Payment Terms
range includes: any-code
term status: proposed

Payment Terms
type: Class
definition: The terms of payment for a trade (due date, discount and penalty terms).
object nature: value
term status: proposed