description
type: DatatypeProperty
definition: A textual description of an item.
range includes: string
term status: proposed

identifier
type: ObjectProperty
definition: An identifier of this entity within some scheme, as an Identifier value object; an entity may bear several (e.g. a GTIN and an internal SKU). Its own resolvable identity is the node URI (@id).
range includes: Identifier
term status: proposed

name
type: DatatypeProperty
definition: The name of an item.
domain includes: Identifier
range includes: string
term status: proposed

public information
type: DatatypeProperty
definition: A URL to publicly available information about the registered identity.
domain includes: Registered Identity
range includes: anyURI
term status: proposed

register type
type: ObjectProperty
comment: code → registry-type scheme.
definition: The type of register in which the identity is recorded.
domain includes: Registered Identity
range includes: registry-type
term status: proposed

registered date
type: DatatypeProperty
definition: The date on which the identity was registered.
domain includes: Registered Identity
range includes: date
term status: proposed

registered name
type: DatatypeProperty
definition: The name of the entity as recorded in the register.
domain includes: Registered Identity
range includes: string
term status: proposed

registrar
type: ObjectProperty
definition: The party (registry authority) that maintains the register.
domain includes: Registered Identity
range includes: Party
term status: proposed

registration ID
type: ObjectProperty
definition: An official registration identifier of an organisation.
domain includes: Facility
domain includes: Organisation
domain includes: Registered Identity
range includes: Identifier
term status: proposed

registration scope
type: DatatypeProperty
definition: A URL describing the scope of the registration.
domain includes: Registered Identity
range includes: anyURI
term status: proposed

Registered Identity
type: Class
definition: The registration of a party's identity in an official register (the subject of a Digital Identity Anchor).
object nature: entity
term status: proposed