delivery date
type: DatatypeProperty
definition: The date (agreed or actual) of delivery of the shipment.
domain includes: Shipment
range includes: date
term status: proposed

description
type: DatatypeProperty
definition: A textual description of an item.
range includes: string
term status: proposed

identifier
type: ObjectProperty
definition: An identifier of this entity within some scheme, as an Identifier value object; an entity may bear several (e.g. a GTIN and an internal SKU). Its own resolvable identity is the node URI (@id).
range includes: Identifier
term status: proposed

includes package
type: ObjectProperty
definition: A shipment package within the shipment.
domain includes: Shipment
range includes: ShipmentPackage
term status: proposed

name
type: DatatypeProperty
definition: The name of an item.
domain includes: Identifier
range includes: string
term status: proposed

realised by
type: ObjectProperty
definition: A consignment that realises (physically transports) the shipment.
domain includes: Shipment
range includes: Consignment
term status: proposed

ship from
type: ObjectProperty
definition: The party the shipment is dispatched from.
domain includes: Shipment
range includes: Party
term status: proposed

ship to
type: ObjectProperty
definition: The party the shipment is delivered to.
domain includes: Shipment
range includes: Party
term status: proposed

Shipment
type: Class
definition: An identifiable collection of trade items transported together from seller (consignor) to buyer (consignee).
object nature: entity
term status: proposed