applies charge
type: ObjectProperty
definition: An allowance or charge applied to a trade agreement or item.
domain includes: TradeAgreement
domain includes: Trade Item
range includes: AllowanceCharge
term status: proposed

applies tax
type: ObjectProperty
definition: A tax applied to a trade agreement or item.
domain includes: TradeAgreement
domain includes: Trade Item
range includes: TradeTax
term status: proposed

line amount
type: ObjectProperty
definition: The net amount of the trade item line.
domain includes: Trade Item
range includes: MonetaryAmount
term status: proposed

ordered quantity
type: ObjectProperty
definition: The quantity ordered for the trade item.
domain includes: Trade Item
range includes: Measure
term status: proposed

supplied product
type: ObjectProperty
definition: The product supplied as this trade item.
domain includes: Trade Item
range includes: Product
term status: proposed

unit price
type: ObjectProperty
definition: The price per unit of the trade item.
domain includes: Trade Item
range includes: MonetaryAmount
term status: proposed

Trade Item
type: Class
definition: The lowest level of commercial information in a trade — a product/service line with code, quantity and unit price.
object nature: value
term status: proposed