actual route
type: ObjectProperty
comment: restored from BSP (default-keep re-triage)
definition: An actual route for this piece of logistics transport equipment.
domain includes: TransportEquipment
range includes: TransportRoute
term status: proposed