address type code
type: ObjectProperty
comment: added from BSP (default-keep re-triage)
domain includes: Address
range includes: address-type-code-list
definition: A code specifying the type of this trade address, such as business address or home address.
term status: proposed