applicable batch
type: ObjectProperty
comment: collapses BSP applicable/substitute/substituted batch variants → one relationship.
definition: A product batch applicable to this consignment item.
domain includes: ConsignmentItem
range includes: ProductBatch
term status: proposed