applicable insurance
type: ObjectProperty
comment: brought back from BSP (UNVTD grounding).
domain includes: Consignment
range includes: Insurance
definition: An insurance covering this consignment.
term status: proposed