applicable licence
type: ObjectProperty
comment: added from BSP (default-keep re-triage)
definition: A specified licence applicable to this production process.
domain includes: ProductionProcess
range includes: Licence
term status: proposed