applicable percent
type: DatatypeProperty
comment: added from BSP (per-class property assessment)
definition: The percent of trade tax applicable, such as to an object or an activity.
domain includes: TradeTax
range includes: decimal
term status: proposed