area number code
type: ObjectProperty
comment: added from BSP (per-class property assessment)
domain includes: ContactPoint
range includes: any-code
definition: The code specifying the area number for this universal communication.
term status: proposed