Authority extended mra
type: Concept
definition: Independent peer assessment for accredited CAB. This pathway applies to CABs accredited under the Mutual Recognition Arrangement of the Global Accreditation Cooperation Incorporated. Schemes used by CABs may be owned by the peer assessment body but the CAB itself shall not be owned by or otherwise related to the peer assessment body.
in scheme: assessment-level
notation: authority-extended-mra