Authority peer
type: Concept
definition: Peer assessment process managed by government. Ownership or mandate provided by national government or intergovernmental entity.
in scheme: assessment-level
notation: authority-peer