Scheme cab
type: Concept
definition: Scheme owner recognition of other parties assessing against the scheme standards. The linked scheme self-declaration can be used to assist in judging credibility of the scheme. Users of conformity credentials issued by a CAB recognised under a scheme may refer to the linked scheme self-declaration for details of the CAB-approval process used by the scheme owner
in scheme: assessment-level
notation: scheme-cab