Scheme self
type: Concept
definition: Scheme owner directly conducting conformity assessment activities. The linked scheme self-declaration can be used to assist in judging credibility of the scheme.
in scheme: assessment-level
notation: scheme-self