Product
type: Concept
definition: The conformity profile targets products — assessing characteristics, composition, performance, or safety of manufactured goods.
in scheme: Assessment Subject Type
notation: product

Assessment Subject Type
type: ConceptScheme
source: AssessmentSubjectType
definition: Assessment Subject Type UN/CEFACT code list.
code list scope: domain
term status: proposed

Facility
type: Concept
definition: The conformity profile targets facilities — assessing the operational practices, environmental performance, or working conditions at a specific site.
in scheme: Assessment Subject Type
notation: facility

Organisation
type: Concept
definition: The conformity profile targets organisations — assessing entity-level governance, policies, management systems, or corporate sustainability performance.
in scheme: Assessment Subject Type
notation: organisation