assessor level
type: ObjectProperty
comment: code → assessor-level scheme.
definition: The level of independent assurance of the assessor.
domain includes: ConformityAttestation
range includes: assessor-level
term status: proposed