attention of
type: DatatypeProperty
comment: restored from BSP (default-keep re-triage)
definition: The name, expressed as text, of a person or department in the organization to whom incoming mail is marked with words such as 'for the attention of' or 'FAO' or 'ATTN' for this trade address.
domain includes: Address
range includes: string
term status: proposed