building number
type: DatatypeProperty
comment: restored from BSP (default-keep re-triage)
definition: The building number, expressed as text, in this trade address.
domain includes: Address
range includes: string
term status: proposed