calculation basis price
type: ObjectProperty
comment: added from BSP (per-class property assessment)
domain includes: ServiceCharge
range includes: TradePrice
definition: The trade price upon which a calculation of this logistics service charge is or will be based.
term status: proposed