calculation method code
type: ObjectProperty
comment: added from BSP (per-class property assessment)
definition: The code specifying the method by which this trade related tax, levy or duty is calculated, such as codes for "tax calculated after line total summation", "tax calculated before line total summation", "tax back calculated based on grand total".
domain includes: TradeTax
range includes: any-code
term status: proposed