care of
type: DatatypeProperty
comment: restored from BSP (default-keep re-triage)
definition: The name, expressed as text, of a person or organization at this trade address to whom incoming mail is marked with words such as 'care of' or 'C/O'.
domain includes: Address
range includes: string
term status: proposed