carrier
type: ObjectProperty
definition: The party undertaking or arranging the carriage of goods.
domain includes: Consignment
domain includes: TransportLeg
domain includes: TransportMovement
range includes: Party
term status: proposed