category trade tax
type: ObjectProperty
comment: added from BSP (per-class property assessment)
domain includes: AllowanceCharge
range includes: TradeTax
definition: A tax category of this trade allowance charge.
term status: proposed