communication capability code
type: ObjectProperty
comment: added from BSP (per-class property assessment)
domain includes: IOTDevice
range includes: any-code
definition: The code specifying the communication capability of this monitoring IOT device.
term status: proposed