communication channel code
type: ObjectProperty
comment: added from BSP (default-keep re-triage)
domain includes: ContactPoint
range includes: communication-channel-code-list
definition: The code specifying the channel by which this referenced document is sent, such as mail, email, fax.
term status: proposed