Forced Labor Elimination
type: Concept
broader: human-equity-and-welfare
definition: Preventing all forms of forced, bonded, or compulsory labor including debt bondage and human trafficking in supply chains.
in scheme: conformity-topics
notation: 02.06
related match: http://metadata.un.org/sdg/8
scope note: EU ESPR Art. 10 - Human Rights Due Diligence.