Living Conditions
type: Concept
broader: health-and-safety
definition: Ensuring safe, sanitary, and dignified accommodation for workers where employer-provided housing is applicable.
in scheme: conformity-topics
notation: 07.04
related match: http://metadata.un.org/sdg/3
scope note: EU ESPR Art. 10 - Worker Welfare.