Nutrition Standards
type: Concept
broader: health-and-safety
definition: Ensuring safe, adequate, and nutritious food provisions for workers where employer-provided meals are applicable.
in scheme: conformity-topics
notation: 07.07
related match: http://metadata.un.org/sdg/3
scope note: EU ESPR Art. 10 - Worker Welfare.