Resource Circularity
type: Concept
broader: circular-value-chains
definition: Promoting reuse, remanufacturing, and recycling of materials to create closed-loop resource flows.
in scheme: conformity-topics
notation: 05.03
related match: http://metadata.un.org/sdg/12
scope note: EU ESPR Art. 8 - Recycled Content; UNTP circularity.content.