Rights and Equality
type: Concept
broader: human-equity-and-welfare
definition: Ensuring non-discrimination and equal treatment regardless of race, gender, religion, disability, or other protected characteristics.
in scheme: conformity-topics
notation: 02.01
related match: http://metadata.un.org/sdg/10
scope note: EU ESPR Art. 10 - Social Sustainability; UNTP social.rights.