Supply Network Strength
type: Concept
broader: economic-sustainability
definition: Enhancing the stability, diversity, and resilience of value chain networks against disruption.
in scheme: conformity-topics
notation: 06.08
related match: http://metadata.un.org/sdg/9
scope note: EU ESPR Art. 10 - Supply Chain Resilience.