Worker Representation
type: Concept
broader: human-equity-and-welfare
definition: Respecting freedom of association, collective bargaining rights, and worker participation in workplace governance.
in scheme: conformity-topics
notation: 02.05
related match: http://metadata.un.org/sdg/8
scope note: EU ESPR Annex I - Labor Rights.