content code
type: ObjectProperty
comment: added from BSP (per-class property assessment)
domain includes: Marking
range includes: any-code
definition: A code specifying the content of this note.
term status: proposed