contract general conditions
type: DatatypeProperty
comment: brought back from BSP (UNVTD grounding gap)
domain includes: Insurance
range includes: string
definition: The contract general conditions, expressed as text, for this transport cargo insurance.
term status: proposed