transport contract movement contract movement type code
type: ObjectProperty
comment: added from BSP (default-keep re-triage)
domain includes: Service
range includes: transport-contract-movement-code-list
definition: A code specifying a contract movement type of this transport service.
term status: proposed