country of operation
type: ObjectProperty
comment: code → ISO 3166-1 scheme.
definition: The country in which a facility operates, as an ISO 3166-1 code.
domain includes: Facility
range includes: country-id
term status: proposed