creation date time
type: DatatypeProperty
comment: added from BSP (per-class property assessment)
domain includes: ProductBatch
range includes: dateTime
definition: The creation date, time, date time, or other date time value for this payment trade settlement.
term status: proposed