customs office
type: ObjectProperty
comment: Collapses BSP's entry/exit/export/import/transit office locations to one relationship.
definition: A customs office location involved in the procedure (entry, exit, transit, …).
domain includes: RegulatoryProcedure
range includes: Location
term status: proposed