delivery instructions
type: DatatypeProperty
comment: brought back from BSP; attached to existing class (BSP home dissolved/niche)
definition: Delivery instructions for this piece of logistics transport equipment.
domain includes: Consignment
range includes: string
term status: proposed