department name
type: DatatypeProperty
comment: restored from BSP (default-keep re-triage)
domain includes: Address
range includes: string
definition: A name, expressed as text, of the department to which this trade contact belongs within an organization.
term status: proposed