description code
type: ObjectProperty
comment: added from BSP (per-class property assessment)
domain includes: ProductBatch
range includes: any-code
definition: A code specifying a description of this technical characteristic.
term status: proposed