designation
type: DatatypeProperty
comment: restored from BSP (default-keep re-triage)
definition: A designation, expressed as text, for this trade product.
domain includes: Product
range includes: string
term status: proposed