determination code
type: ObjectProperty
comment: added from BSP (per-class property assessment)
domain includes: TradePrice
range includes: any-code
definition: The code specifying the determination of this trade price.
term status: proposed