dimension type code
type: ObjectProperty
comment: added from BSP (default-keep re-triage)
domain includes: Dimension
range includes: dimension-type-code-list
definition: The code specifying the type of spatial dimension, such as thickness, area, or volume.
term status: proposed