dimensions
type: ObjectProperty
domain includes: Product
domain includes: ConsignmentItem
domain includes: TransportMeans
domain includes: TransportPackage
domain includes: ProductPackage
range includes: Dimension
definition: The overall dimensions of the product, package, consignment item or transport means.
term status: proposed